{"text_format":"1","workbook":"xlsx","n_sheets":4,"sheets":["Log","SOAL","Peserta","HASIL"],"not_rendered":{"charts":0,"images":0,"macros":1,"external_links":0,"defined_names":2,"comments":0,"pivot_tables":0},"unopened":[],"bounds":{"document_bytes":16777216,"sheet_cells":100000,"rows_first":2000,"rows_last":500,"rows_between":2000,"halvings":0,"cell_chars":16384,"cell_head_chars":4096},"cells_cut":0,"cells_raw":0,"read":"whole","date_system":"1900"}

{"sheet":"Log","index":0,"n_rows":1,"n_cols":1,"rows_kept":1,"cut":false,"hidden":true,"merged":[]}
[";;;;;;;"]

{"sheet":"SOAL","index":1,"n_rows":42,"n_cols":20,"rows_kept":42,"cut":false,"hidden":false,"merged":[[13,2,13,4],[0,13,1,13],[7,3,7,4],[2,6,2,7],[0,9,1,9],[0,10,1,10],[0,11,1,11],[0,12,1,12],[30,17,30,20],[31,17,31,20],[7,17,7,20],[8,17,18,20],[0,14,1,14],[25,17,25,20],[26,17,26,20],[27,17,27,20],[28,17,28,20],[29,17,29,20],[20,17,20,20],[21,17,21,20],[22,17,22,20],[23,17,23,20],[24,17,24,20]]}
[null,1,"Server :","http://192.168.1.1:8888/ubk/",null,null,null,null,null,"No.\nSoal","Kunci\nJawaban","Skor","Grouping","Lock\nN","KD"]
[null,null,"Kode Test :","UAS1 - SEJINDO","Prodik kreatif dan kewirausahaan"]
[null,null,"Nama Test :","Produk kreatif dan kewirausahaan",null,"Key :",null,null,null,1,"e",2.5,null,null,1,null,null,null,null,{"$f":"COUNTA(C10:C1048576)","v":5}]
[null,null,"Status :","Aktif",null,null,null,null,null,2,"b",2.5,null,null,1]
[null,null,"Sub Test :","UAS",null,null,null,null,null,3,"a",2.5,null,null,1]
[null,null,"Tanggal :","06","-","06","-","2022",null,4,"c",2.5,null,null,1]
[null,null,"Waktu Test :","07",":","00",null,null,null,5,"c",2.5,null,null,1]
[null,null,"Alokasi :",60,null,null,null,null,null,6,"a",2.5,null,null,1,null,null,"LOG. Versi Excel #12.2.0"]
[null,null,"Jumlah Soal :",40,null,null,null,null,null,7,"b",2.5,null,null,1,null,null,";;;;;;;"]
[null,null,"Yang Harus Dikerjakan :",40,null,null,null,null,null,8,"c",2.5,null,null,1]
[null,null,"Acak Soal / Option :",1,"/",1,null,null,null,9,"a",2.5,null,null,1]
[null,null,"http://192.168.0.209:5001/cbtapplication-5f0e6/us-central1/cbtadmin/1/",null,null,null,null,null,null,10,"c",2.5,null,null,1]
[null,null,null,null,null,null,null,null,null,11,"a",2.5,null,null,1]
[null,null,"Alokasi KD",null,null,null,null,null,null,12,"b",2.5,null,null,1]
[null,null,"Nama KD","Alokasi","Total KD",null,null,null,null,13,"c",2.5,null,null,1]
[null,5,null,null,null,null,null,null,null,14,"d",2.5,null,null,1]
[null,null,null,null,null,null,null,null,null,15,"e",2.5,null,null,1]
[null,null,null,null,null,null,null,null,null,16,"a",2.5,null,null,1]
[null,null,null,null,null,null,null,null,null,17,"b",2.5,null,null,1]
[null,null,null,null,null,null,null,null,null,18,"c",2.5,null,null,1]
[null,null,null,null,null,null,null,null,null,19,"d",2.5,null,null,1,null,null,"Compatible Dengan"]
[null,null,null,null,null,null,null,null,null,20,"e",2.5,null,null,1,null,null,"#11.3.13"]
[null,null,null,null,null,null,null,null,null,21,"a",2.5,null,null,1,null,null,"#12.0.0"]
[null,null,null,null,null,null,null,null,null,22,"b",2.5,null,null,1,null,null,"#12.0.1"]
[null,null,null,null,null,null,null,null,null,23,"c",2.5,null,null,1,null,null,"#12.2.7"]
[null,null,null,null,null,null,null,null,null,24,"d",2.5,null,null,1]
[null,null,null,null,null,null,null,null,null,25,"e",2.5,null,null,1]
[null,null,null,null,null,null,null,null,null,26,"a",2.5,null,null,1]
[null,null,null,null,null,null,null,null,null,27,"b",2.5,null,null,1]
[null,null,null,null,null,null,null,null,null,28,"c",2.5,null,null,1]
[null,null,null,null,null,null,null,null,null,29,"d",2.5,null,null,1]
[null,null,null,null,null,null,null,null,null,30,"e",2.5,null,null,1]
[null,null,null,null,null,null,null,null,null,31,"b",2.5,null,null,1]
[null,null,null,null,null,null,null,null,null,32,"d",2.5,null,null,1]
[null,null,null,null,null,null,null,null,null,33,"c",2.5,null,null,1]
[null,null,null,null,null,null,null,null,null,34,"a",2.5,null,null,1]
[null,null,null,null,null,null,null,null,null,35,"b",2.5,null,null,1]
[null,null,null,null,null,null,null,null,null,36,"e",2.5,null,null,1]
[null,null,null,null,null,null,null,null,null,37,"a",2.5,null,null,1]
[null,null,null,null,null,null,null,null,null,38,"c",2.5,null,null,1]
[null,null,null,null,null,null,null,null,null,39,"e",2.5,null,null,1]
[null,null,null,null,null,null,null,null,null,40,"b",2.5,null,null,1]

{"sheet":"Peserta","index":2,"n_rows":90,"n_cols":15,"rows_kept":90,"cut":false,"hidden":false,"merged":[[9,11,9,12],[11,11,11,12],[13,11,13,12],[15,11,15,12]]}
[]
[null,null,"Jumlah Peserta :",{"$f":"COUNTA(B4:B831)","v":65}]
[null,"NIS","Username","Nama","Password","Keterangan (1)","Keterangan (2)","Server","Sesi","Status"]
[null,1,"K05330213001","ALFINO FATHUR ROZY PRATAMA","101011*","TKJ10A","SMK FULL DAY BUSTANUL ULUM","Server 1",1,{"$f":"INDEX(HASIL!$H:$H,MATCH(C4,HASIL!D:D,0))","v":{"$error":"#N/A"}}]
[null,2,"K05330213002","ANDRE KURNIAWAN","101012*","TKJ10A","SMK FULL DAY BUSTANUL ULUM","Server 1",1,{"$f":"INDEX(HASIL!$H:$H,MATCH(C5,HASIL!D:D,0))","v":{"$error":"#N/A"}}]
[null,3,"K05330213003","ANGGI SAPUTRA RAMADANI","101013*","TKJ10A","SMK FULL DAY BUSTANUL ULUM","Server 1",1,{"$f":"INDEX(HASIL!$H:$H,MATCH(C6,HASIL!D:D,0))","v":{"$error":"#N/A"}}]
[null,4,"K05330213004","DIO AZRIAL KURNIAWAN ","101014*","TKJ10A","SMK FULL DAY BUSTANUL ULUM","Server 1",1,{"$f":"INDEX(HASIL!$H:$H,MATCH(C7,HASIL!D:D,0))","v":{"$error":"#N/A"}}]
[null,5,"K05330213005","FATHUL HASIM (Maktuba)","101015*","TKJ10A","SMK FULL DAY BUSTANUL ULUM","Server 1",1,{"$f":"INDEX(HASIL!$H:$H,MATCH(C8,HASIL!D:D,0))","v":{"$error":"#N/A"}}]
[null,6,"K05330213006","FERDIANSYAH","101016*","TKJ10A","SMK FULL DAY BUSTANUL ULUM","Server 1",1,{"$f":"INDEX(HASIL!$H:$H,MATCH(C9,HASIL!D:D,0))","v":{"$error":"#N/A"}}]
[null,7,"K05330213007","FIRMAN LUTFI (Maktuba)","101017*","TKJ10A","SMK FULL DAY BUSTANUL ULUM","Server 1",1,{"$f":"INDEX(HASIL!$H:$H,MATCH(C10,HASIL!D:D,0))","v":{"$error":"#N/A"}},null,"Mengerjakan",null,null,{"$f":"COUNTIF(J:J,\"Mengerjakan\")","v":0}]
[null,8,"K05330213008","HAVIS ZURROHMAN (Maktuba)","101018*","TKJ10A","SMK FULL DAY BUSTANUL ULUM","Server 1",1,{"$f":"INDEX(HASIL!$H:$H,MATCH(C11,HASIL!D:D,0))","v":{"$error":"#N/A"}}]
[null,9,"K05330213009","HUSNI MUBAROK","101019*","TKJ10A","SMK FULL DAY BUSTANUL ULUM","Server 1",1,{"$f":"INDEX(HASIL!$H:$H,MATCH(C12,HASIL!D:D,0))","v":{"$error":"#N/A"}},null,"Selesai",null,null,{"$f":"COUNTIF(J:J,\"Selesai\")","v":0}]
[null,10,"K05330213010","JEFRI MAULANA (Maktuba)","101020*","TKJ10A","SMK FULL DAY BUSTANUL ULUM","Server 1",1,{"$f":"INDEX(HASIL!$H:$H,MATCH(C13,HASIL!D:D,0))","v":{"$error":"#N/A"}}]
[null,11,"K05330213011","KHOIRUL ANAS","101021*","TKJ10A","SMK FULL DAY BUSTANUL ULUM","Server 1",1,{"$f":"INDEX(HASIL!$H:$H,MATCH(C14,HASIL!D:D,0))","v":{"$error":"#N/A"}},null,"Logout",null,null,{"$f":"COUNTIF(J:J,\"Logout\")","v":0}]
[null,12,"K05330213012","M. ALI WAFA","101022*","TKJ10A","SMK FULL DAY BUSTANUL ULUM","Server 1",1,{"$f":"INDEX(HASIL!$H:$H,MATCH(C15,HASIL!D:D,0))","v":{"$error":"#N/A"}}]
[null,13,"K05330213013","M. AZKA FAILANDRI (Maktuba)","101023*","TKJ10A","SMK FULL DAY BUSTANUL ULUM","Server 1",1,{"$f":"INDEX(HASIL!$H:$H,MATCH(C16,HASIL!D:D,0))","v":{"$error":"#N/A"}},null,"Belum Login",null,null,{"$f":"COUNTIF(J:J,\"#N/A\")","v":87}]
[null,14,"K05330213014","M. ERWIN ERIYAWAN","101024*","TKJ10A","SMK FULL DAY BUSTANUL ULUM","Server 1",1,{"$f":"INDEX(HASIL!$H:$H,MATCH(C17,HASIL!D:D,0))","v":{"$error":"#N/A"}}]
[null,15,"K05330213015","M. Irfani Efendi (Maktuba)","101025*","TKJ10A","SMK FULL DAY BUSTANUL ULUM","Server 1",1,{"$f":"INDEX(HASIL!$H:$H,MATCH(C18,HASIL!D:D,0))","v":{"$error":"#N/A"}}]
[null,16,"K05330213016","M. SIGIT IBRANI","101026*","TKJ10A","SMK FULL DAY BUSTANUL ULUM","Server 1",1,{"$f":"INDEX(HASIL!$H:$H,MATCH(C19,HASIL!D:D,0))","v":{"$error":"#N/A"}}]
[null,17,"K05330213017","M. ZAINAL ARIFIN (Maktuba)","101027*","TKJ10A","SMK FULL DAY BUSTANUL ULUM","Server 1",1,{"$f":"INDEX(HASIL!$H:$H,MATCH(C20,HASIL!D:D,0))","v":{"$error":"#N/A"}}]
[null,18,"K05330213018","MOCH. ZAENAL ALI","101028*","TKJ10A","SMK FULL DAY BUSTANUL ULUM","Server 1",1,{"$f":"INDEX(HASIL!$H:$H,MATCH(C21,HASIL!D:D,0))","v":{"$error":"#N/A"}}]
[null,19,"K05330213019","MOHAMMAD DENIY FERDIANSYAH","101029*","TKJ10A","SMK FULL DAY BUSTANUL ULUM","Server 1",1,{"$f":"INDEX(HASIL!$H:$H,MATCH(C22,HASIL!D:D,0))","v":{"$error":"#N/A"}}]
[null,20,"K05330213020","MOHAMMAD MAFTUH BASTUL BIRRIH","101030*","TKJ10A","SMK FULL DAY BUSTANUL ULUM","Server 1",1,{"$f":"INDEX(HASIL!$H:$H,MATCH(C23,HASIL!D:D,0))","v":{"$error":"#N/A"}}]
[null,21,"K05330213021","MUHAMAD YUNUS","101031*","TKJ10A","SMK FULL DAY BUSTANUL ULUM","Server 1",1,{"$f":"INDEX(HASIL!$H:$H,MATCH(C24,HASIL!D:D,0))","v":{"$error":"#N/A"}}]
[null,22,"K05330213022","MUHAMMAD ILYAS ","101032*","TKJ10A","SMK FULL DAY BUSTANUL ULUM","Server 1",1,{"$f":"INDEX(HASIL!$H:$H,MATCH(C25,HASIL!D:D,0))","v":{"$error":"#N/A"}}]
[null,23,"K05330213023","MUHAMMAD LUTFI HUDAIFI (Maktuba)","101033*","TKJ10A","SMK FULL DAY BUSTANUL ULUM","Server 1",1,{"$f":"INDEX(HASIL!$H:$H,MATCH(C26,HASIL!D:D,0))","v":{"$error":"#N/A"}}]
[null,24,"K05330213024","MUHAMMAD RISKI (Maktuba)","101034*","TKJ10A","SMK FULL DAY BUSTANUL ULUM","Server 1",1,{"$f":"INDEX(HASIL!$H:$H,MATCH(C27,HASIL!D:D,0))","v":{"$error":"#N/A"}}]
[null,25,"K05330213025","MUHAMMAD SHOLEH","101035*","TKJ10A","SMK FULL DAY BUSTANUL ULUM","Server 1",1,{"$f":"INDEX(HASIL!$H:$H,MATCH(C28,HASIL!D:D,0))","v":{"$error":"#N/A"}}]
[null,26,"K05330213026","MUHAMMAD YANDI HIDAYATUR ROHMAN","101036*","TKJ10A","SMK FULL DAY BUSTANUL ULUM","Server 1",1,{"$f":"INDEX(HASIL!$H:$H,MATCH(C29,HASIL!D:D,0))","v":{"$error":"#N/A"}}]
[null,27,"K05330213027","RAIHANDI","101037*","TKJ10A","SMK FULL DAY BUSTANUL ULUM","Server 1",1,{"$f":"INDEX(HASIL!$H:$H,MATCH(C30,HASIL!D:D,0))","v":{"$error":"#N/A"}}]
[null,28,"K05330213028","RUDI RIFAND","101038*","TKJ10A","SMK FULL DAY BUSTANUL ULUM","Server 1",1,{"$f":"INDEX(HASIL!$H:$H,MATCH(C31,HASIL!D:D,0))","v":{"$error":"#N/A"}}]
[null,29,"K05330213029","TIAS AGUS RIFANDI","101039*","TKJ10A","SMK FULL DAY BUSTANUL ULUM","Server 1",1,{"$f":"INDEX(HASIL!$H:$H,MATCH(C32,HASIL!D:D,0))","v":{"$error":"#N/A"}}]
[null,30,"K05330213030","WILDAN MAULANA","101040*","TKJ10A","SMK FULL DAY BUSTANUL ULUM","Server 1",1,{"$f":"INDEX(HASIL!$H:$H,MATCH(C33,HASIL!D:D,0))","v":{"$error":"#N/A"}}]
[null,31,"K05330213031","YOGA PRATAMA","101041*","TKJ10A","SMK FULL DAY BUSTANUL ULUM","Server 1",1,{"$f":"INDEX(HASIL!$H:$H,MATCH(C34,HASIL!D:D,0))","v":{"$error":"#N/A"}}]
[null,32,"K05330213032","ADISTA ABELIA","101042*","TKJ10B","SMK FULL DAY BUSTANUL ULUM","Server 1",1,{"$f":"INDEX(HASIL!$H:$H,MATCH(C35,HASIL!D:D,0))","v":{"$error":"#N/A"}}]
[null,33,"K05330213033","AFRISYAH FANIKA FIRDAUSYI","101043*","TKJ10B","SMK FULL DAY BUSTANUL ULUM","Server 1",1,{"$f":"INDEX(HASIL!$H:$H,MATCH(C36,HASIL!D:D,0))","v":{"$error":"#N/A"}}]
[null,34,"K05330213034","AIZZATUL ULFA","101044*","TKJ10B","SMK FULL DAY BUSTANUL ULUM","Server 1",1,{"$f":"INDEX(HASIL!$H:$H,MATCH(C37,HASIL!D:D,0))","v":{"$error":"#N/A"}}]
[null,35,"K05330213035","ALIN","101045*","TKJ10B","SMK FULL DAY BUSTANUL ULUM","Server 1",1,{"$f":"INDEX(HASIL!$H:$H,MATCH(C38,HASIL!D:D,0))","v":{"$error":"#N/A"}}]
[null,36,"K05330213036","ATIKA SARI DEVI","101046*","TKJ10B","SMK FULL DAY BUSTANUL ULUM","Server 1",1,{"$f":"INDEX(HASIL!$H:$H,MATCH(C39,HASIL!D:D,0))","v":{"$error":"#N/A"}}]
[null,37,"K05330213037","DERIL MAR'ATUS SHOLEHA","101047*","TKJ10B","SMK FULL DAY BUSTANUL ULUM","Server 1",1,{"$f":"INDEX(HASIL!$H:$H,MATCH(C40,HASIL!D:D,0))","v":{"$error":"#N/A"}}]
[null,38,"K05330213038","DIAH PERMATA SARI ","101048*","TKJ10B","SMK FULL DAY BUSTANUL ULUM","Server 1",1,{"$f":"INDEX(HASIL!$H:$H,MATCH(C41,HASIL!D:D,0))","v":{"$error":"#N/A"}}]
[null,39,"K05330213039","HANIFATUR ROHIL","101049*","TKJ10B","SMK FULL DAY BUSTANUL ULUM","Server 1",1,{"$f":"INDEX(HASIL!$H:$H,MATCH(C42,HASIL!D:D,0))","v":{"$error":"#N/A"}}]
[null,40,"K05330213040","HILDATUS SA'DIYAH NASUTION","101050*","TKJ10B","SMK FULL DAY BUSTANUL ULUM","Server 1",1,{"$f":"INDEX(HASIL!$H:$H,MATCH(C43,HASIL!D:D,0))","v":{"$error":"#N/A"}}]
[null,41,"K05330213041","HILYATUS ZAHRO","101051*","TKJ10B","SMK FULL DAY BUSTANUL ULUM","Server 1",1,{"$f":"INDEX(HASIL!$H:$H,MATCH(C44,HASIL!D:D,0))","v":{"$error":"#N/A"}}]
[null,42,"K05330213042","INDI LAILATUL JANNAH","101052*","TKJ10B","SMK FULL DAY BUSTANUL ULUM","Server 1",1,{"$f":"INDEX(HASIL!$H:$H,MATCH(C45,HASIL!D:D,0))","v":{"$error":"#N/A"}}]
[null,43,"K05330213043","INTAN INDAH YUNIAR","101053*","TKJ10B","SMK FULL DAY BUSTANUL ULUM","Server 1",1,{"$f":"INDEX(HASIL!$H:$H,MATCH(C46,HASIL!D:D,0))","v":{"$error":"#N/A"}}]
[null,44,"K05330213044","ISNAINI","101054*","TKJ10B","SMK FULL DAY BUSTANUL ULUM","Server 1",1,{"$f":"INDEX(HASIL!$H:$H,MATCH(C47,HASIL!D:D,0))","v":{"$error":"#N/A"}}]
[null,45,"K05330213045","KHUSNUL HOTIMAH","101055*","TKJ10B","SMK FULL DAY BUSTANUL ULUM","Server 1",1,{"$f":"INDEX(HASIL!$H:$H,MATCH(C48,HASIL!D:D,0))","v":{"$error":"#N/A"}}]
[null,46,"K05330213046","LAELATUL RAMADHANI","101056*","TKJ10B","SMK FULL DAY BUSTANUL ULUM","Server 1",1,{"$f":"INDEX(HASIL!$H:$H,MATCH(C49,HASIL!D:D,0))","v":{"$error":"#N/A"}}]
[null,47,"K05330213047","LAILA MADANIA KHOLIFAH","101057*","TKJ10B","SMK FULL DAY BUSTANUL ULUM","Server 1",1,{"$f":"INDEX(HASIL!$H:$H,MATCH(C50,HASIL!D:D,0))","v":{"$error":"#N/A"}}]
[null,48,"K05330213048","LILIK NUR KHOLIFAH","101058*","TKJ10B","SMK FULL DAY BUSTANUL ULUM","Server 1",1,{"$f":"INDEX(HASIL!$H:$H,MATCH(C51,HASIL!D:D,0))","v":{"$error":"#N/A"}}]
[null,49,"K05330213049","LUTFIYATUS SOLEHA","101059*","TKJ10B","SMK FULL DAY BUSTANUL ULUM","Server 1",1,{"$f":"INDEX(HASIL!$H:$H,MATCH(C52,HASIL!D:D,0))","v":{"$error":"#N/A"}}]
[null,50,"K05330213050","NADELIA FIRDAUSI","101060*","TKJ10B","SMK FULL DAY BUSTANUL ULUM","Server 1",1,{"$f":"INDEX(HASIL!$H:$H,MATCH(C53,HASIL!D:D,0))","v":{"$error":"#N/A"}}]
[null,51,"K05330213051","NADYATUS SHOLEHA","101061*","TKJ10B","SMK FULL DAY BUSTANUL ULUM","Server 1",1,{"$f":"INDEX(HASIL!$H:$H,MATCH(C54,HASIL!D:D,0))","v":{"$error":"#N/A"}}]
[null,52,"K05330213052","NOR ALFUL LAILA","101062*","TKJ10B","SMK FULL DAY BUSTANUL ULUM","Server 1",1,{"$f":"INDEX(HASIL!$H:$H,MATCH(C55,HASIL!D:D,0))","v":{"$error":"#N/A"}}]
[null,53,"K05330213053","NOVI INDRIANI","101063*","TKJ10B","SMK FULL DAY BUSTANUL ULUM","Server 1",1,{"$f":"INDEX(HASIL!$H:$H,MATCH(C56,HASIL!D:D,0))","v":{"$error":"#N/A"}}]
[null,54,"K05330213054","NUR FADILA","101064*","TKJ10B","SMK FULL DAY BUSTANUL ULUM","Server 1",1,{"$f":"INDEX(HASIL!$H:$H,MATCH(C57,HASIL!D:D,0))","v":{"$error":"#N/A"}}]
[null,55,"K05330213055","NURIN LAILATUL AMARINA","101065*","TKJ10B","SMK FULL DAY BUSTANUL ULUM","Server 1",1,{"$f":"INDEX(HASIL!$H:$H,MATCH(C58,HASIL!D:D,0))","v":{"$error":"#N/A"}}]
[null,56,"K05330213056","NURIS SHABRINA RAMADHANI","101066*","TKJ10B","SMK FULL DAY BUSTANUL ULUM","Server 1",1,{"$f":"INDEX(HASIL!$H:$H,MATCH(C59,HASIL!D:D,0))","v":{"$error":"#N/A"}}]
[null,57,"K05330213057","OKTAVIA MURNIATI","101067*","TKJ10B","SMK FULL DAY BUSTANUL ULUM","Server 1",1,{"$f":"INDEX(HASIL!$H:$H,MATCH(C60,HASIL!D:D,0))","v":{"$error":"#N/A"}}]
[null,58,"K05330213058","QONIAH ","101068*","TKJ10B","SMK FULL DAY BUSTANUL ULUM","Server 1",1,{"$f":"INDEX(HASIL!$H:$H,MATCH(C61,HASIL!D:D,0))","v":{"$error":"#N/A"}}]
[null,59,"K05330213059","SINTA BELLA","101069*","TKJ10B","SMK FULL DAY BUSTANUL ULUM","Server 1",1,{"$f":"INDEX(HASIL!$H:$H,MATCH(C62,HASIL!D:D,0))","v":{"$error":"#N/A"}}]
[null,60,"K05330213060","SITI MUZAYYANAH","101070*","TKJ10B","SMK FULL DAY BUSTANUL ULUM","Server 1",1,{"$f":"INDEX(HASIL!$H:$H,MATCH(C63,HASIL!D:D,0))","v":{"$error":"#N/A"}}]
[null,61,"K05330213061","SITI NUR AINI","101071*","TKJ10B","SMK FULL DAY BUSTANUL ULUM","Server 1",1,{"$f":"INDEX(HASIL!$H:$H,MATCH(C64,HASIL!D:D,0))","v":{"$error":"#N/A"}}]
[null,62,"K05330213062","SOLEHATUN JANNAH","101072*","TKJ10B","SMK FULL DAY BUSTANUL ULUM","Server 1",1,{"$f":"INDEX(HASIL!$H:$H,MATCH(C65,HASIL!D:D,0))","v":{"$error":"#N/A"}}]
[null,63,"K05330213063","ULFATUN HASANAH","101073*","TKJ10B","SMK FULL DAY BUSTANUL ULUM","Server 1",1,{"$f":"INDEX(HASIL!$H:$H,MATCH(C66,HASIL!D:D,0))","v":{"$error":"#N/A"}}]
[null,64,"K05330213064","ULFI NOVIA","101074*","TKJ10B","SMK FULL DAY BUSTANUL ULUM","Server 1",1,{"$f":"INDEX(HASIL!$H:$H,MATCH(C67,HASIL!D:D,0))","v":{"$error":"#N/A"}}]
[null,65,"K05330213065","UMI HANIK AYU LESTARI","101075*","TKJ10B","SMK FULL DAY BUSTANUL ULUM","Server 1",1,{"$f":"INDEX(HASIL!$H:$H,MATCH(C68,HASIL!D:D,0))","v":{"$error":"#N/A"}}]
[null,null,null,null,null,null,null,null,null,{"$f":"INDEX(HASIL!$H:$H,MATCH(C69,HASIL!D:D,0))","v":{"$error":"#N/A"}}]
[null,null,null,null,null,null,null,null,null,{"$f":"INDEX(HASIL!$H:$H,MATCH(C70,HASIL!D:D,0))","v":{"$error":"#N/A"}}]
[null,null,null,null,null,null,null,null,null,{"$f":"INDEX(HASIL!$H:$H,MATCH(C71,HASIL!D:D,0))","v":{"$error":"#N/A"}}]
[null,null,null,null,null,null,null,null,null,{"$f":"INDEX(HASIL!$H:$H,MATCH(C72,HASIL!D:D,0))","v":{"$error":"#N/A"}}]
[null,null,null,null,null,null,null,null,null,{"$f":"INDEX(HASIL!$H:$H,MATCH(C73,HASIL!D:D,0))","v":{"$error":"#N/A"}}]
[null,null,null,null,null,null,null,null,null,{"$f":"INDEX(HASIL!$H:$H,MATCH(C74,HASIL!D:D,0))","v":{"$error":"#N/A"}}]
[null,null,null,null,null,null,null,null,null,{"$f":"INDEX(HASIL!$H:$H,MATCH(C75,HASIL!D:D,0))","v":{"$error":"#N/A"}}]
[null,null,null,null,null,null,null,null,null,{"$f":"INDEX(HASIL!$H:$H,MATCH(C76,HASIL!D:D,0))","v":{"$error":"#N/A"}}]
[null,null,null,null,null,null,null,null,null,{"$f":"INDEX(HASIL!$H:$H,MATCH(C77,HASIL!D:D,0))","v":{"$error":"#N/A"}}]
[null,null,null,null,null,null,null,null,null,{"$f":"INDEX(HASIL!$H:$H,MATCH(C78,HASIL!D:D,0))","v":{"$error":"#N/A"}}]
[null,null,null,null,null,null,null,null,null,{"$f":"INDEX(HASIL!$H:$H,MATCH(C79,HASIL!D:D,0))","v":{"$error":"#N/A"}}]
[null,null,null,null,null,null,null,null,null,{"$f":"INDEX(HASIL!$H:$H,MATCH(C80,HASIL!D:D,0))","v":{"$error":"#N/A"}}]
[null,null,null,null,null,null,null,null,null,{"$f":"INDEX(HASIL!$H:$H,MATCH(C81,HASIL!D:D,0))","v":{"$error":"#N/A"}}]
[null,null,null,null,null,null,null,null,null,{"$f":"INDEX(HASIL!$H:$H,MATCH(C82,HASIL!D:D,0))","v":{"$error":"#N/A"}}]
[null,null,null,null,null,null,null,null,null,{"$f":"INDEX(HASIL!$H:$H,MATCH(C83,HASIL!D:D,0))","v":{"$error":"#N/A"}}]
[null,null,null,null,null,null,null,null,null,{"$f":"INDEX(HASIL!$H:$H,MATCH(C84,HASIL!D:D,0))","v":{"$error":"#N/A"}}]
[null,null,null,null,null,null,null,null,null,{"$f":"INDEX(HASIL!$H:$H,MATCH(C85,HASIL!D:D,0))","v":{"$error":"#N/A"}}]
[null,null,null,null,null,null,null,null,null,{"$f":"INDEX(HASIL!$H:$H,MATCH(C86,HASIL!D:D,0))","v":{"$error":"#N/A"}}]
[null,null,null,null,null,null,null,null,null,{"$f":"INDEX(HASIL!$H:$H,MATCH(C87,HASIL!D:D,0))","v":{"$error":"#N/A"}}]
[null,null,null,null,null,null,null,null,null,{"$f":"INDEX(HASIL!$H:$H,MATCH(C88,HASIL!D:D,0))","v":{"$error":"#N/A"}}]
[null,null,null,null,null,null,null,null,null,{"$f":"INDEX(HASIL!$H:$H,MATCH(C89,HASIL!D:D,0))","v":{"$error":"#N/A"}}]
[null,null,null,null,null,null,null,null,null,{"$f":"INDEX(HASIL!$H:$H,MATCH(C90,HASIL!D:D,0))","v":{"$error":"#N/A"}}]

{"sheet":"HASIL","index":3,"n_rows":2,"n_cols":211,"rows_kept":2,"cut":false,"hidden":false,"merged":[[0,6,1,6],[0,7,1,7],[0,0,1,0],[0,1,1,1],[0,2,1,2],[0,3,1,3],[0,4,1,4],[0,5,1,5]]}
["No","Keterangan","Nama Peserta","No. Peserta","Subtest Terakhir","Benar/Salah","Nilai","Status",{"$f":"INDEX(SOAL!$J:$J,COLUMN()-6)","v":1},{"$f":"INDEX(SOAL!$J:$J,COLUMN()-6)","v":2},{"$f":"INDEX(SOAL!$J:$J,COLUMN()-6)","v":3},{"$f":"INDEX(SOAL!$J:$J,COLUMN()-6)","v":4},{"$f":"INDEX(SOAL!$J:$J,COLUMN()-6)","v":5},{"$f":"INDEX(SOAL!$J:$J,COLUMN()-6)","v":6},{"$f":"INDEX(SOAL!$J:$J,COLUMN()-6)","v":7},{"$f":"INDEX(SOAL!$J:$J,COLUMN()-6)","v":8},{"$f":"INDEX(SOAL!$J:$J,COLUMN()-6)","v":9},{"$f":"INDEX(SOAL!$J:$J,COLUMN()-6)","v":10},{"$f":"INDEX(SOAL!$J:$J,COLUMN()-6)","v":11},{"$f":"INDEX(SOAL!$J:$J,COLUMN()-6)","v":12},{"$f":"INDEX(SOAL!$J:$J,COLUMN()-6)","v":13},{"$f":"INDEX(SOAL!$J:$J,COLUMN()-6)","v":14},{"$f":"INDEX(SOAL!$J:$J,COLUMN()-6)","v":15},{"$f":"INDEX(SOAL!$J:$J,COLUMN()-6)","v":16},{"$f":"INDEX(SOAL!$J:$J,COLUMN()-6)","v":17},{"$f":"INDEX(SOAL!$J:$J,COLUMN()-6)","v":18},{"$f":"INDEX(SOAL!$J:$J,COLUMN()-6)","v":19},{"$f":"INDEX(SOAL!$J:$J,COLUMN()-6)","v":20},{"$f":"INDEX(SOAL!$J:$J,COLUMN()-6)","v":21},{"$f":"INDEX(SOAL!$J:$J,COLUMN()-6)","v":22},{"$f":"INDEX(SOAL!$J:$J,COLUMN()-6)","v":23},{"$f":"INDEX(SOAL!$J:$J,COLUMN()-6)","v":24},{"$f":"INDEX(SOAL!$J:$J,COLUMN()-6)","v":25},{"$f":"INDEX(SOAL!$J:$J,COLUMN()-6)","v":26},{"$f":"INDEX(SOAL!$J:$J,COLUMN()-6)","v":27},{"$f":"INDEX(SOAL!$J:$J,COLUMN()-6)","v":28},{"$f":"INDEX(SOAL!$J:$J,COLUMN()-6)","v":29},{"$f":"INDEX(SOAL!$J:$J,COLUMN()-6)","v":30},{"$f":"INDEX(SOAL!$J:$J,COLUMN()-6)","v":31},{"$f":"INDEX(SOAL!$J:$J,COLUMN()-6)","v":32},{"$f":"INDEX(SOAL!$J:$J,COLUMN()-6)","v":33},{"$f":"INDEX(SOAL!$J:$J,COLUMN()-6)","v":34},{"$f":"INDEX(SOAL!$J:$J,COLUMN()-6)","v":35},{"$f":"INDEX(SOAL!$J:$J,COLUMN()-6)","v":36},{"$f":"INDEX(SOAL!$J:$J,COLUMN()-6)","v":37},{"$f":"INDEX(SOAL!$J:$J,COLUMN()-6)","v":38},{"$f":"INDEX(SOAL!$J:$J,COLUMN()-6)","v":39},{"$f":"INDEX(SOAL!$J:$J,COLUMN()-6)","v":40},{"$f":"INDEX(SOAL!$J:$J,COLUMN()-6)","v":0},{"$f":"INDEX(SOAL!$J:$J,COLUMN()-6)","v":0},{"$f":"INDEX(SOAL!$J:$J,COLUMN()-6)","v":0},{"$f":"INDEX(SOAL!$J:$J,COLUMN()-6)","v":0},{"$f":"INDEX(SOAL!$J:$J,COLUMN()-6)","v":0},{"$f":"INDEX(SOAL!$J:$J,COLUMN()-6)","v":0},{"$f":"INDEX(SOAL!$J:$J,COLUMN()-6)","v":0},{"$f":"INDEX(SOAL!$J:$J,COLUMN()-6)","v":0},{"$f":"INDEX(SOAL!$J:$J,COLUMN()-6)","v":0},{"$f":"INDEX(SOAL!$J:$J,COLUMN()-6)","v":0},{"$f":"INDEX(SOAL!$J:$J,COLUMN()-6)","v":0},{"$f":"INDEX(SOAL!$J:$J,COLUMN()-6)","v":0},{"$f":"INDEX(SOAL!$J:$J,COLUMN()-6)","v":0},{"$f":"INDEX(SOAL!$J:$J,COLUMN()-6)","v":0},{"$f":"INDEX(SOAL!$J:$J,COLUMN()-6)","v":0},{"$f":"INDEX(SOAL!$J:$J,COLUMN()-6)","v":0},{"$f":"INDEX(SOAL!$J:$J,COLUMN()-6)","v":0},{"$f":"INDEX(SOAL!$J:$J,COLUMN()-6)","v":0},{"$f":"INDEX(SOAL!$J:$J,COLUMN()-6)","v":0},{"$f":"INDEX(SOAL!$J:$J,COLUMN()-6)","v":0},{"$f":"INDEX(SOAL!$J:$J,COLUMN()-6)","v":0},{"$f":"INDEX(SOAL!$J:$J,COLUMN()-6)","v":0},{"$f":"INDEX(SOAL!$J:$J,COLUMN()-6)","v":0},{"$f":"INDEX(SOAL!$J:$J,COLUMN()-6)","v":0},{"$f":"INDEX(SOAL!$J:$J,COLUMN()-6)","v":0},{"$f":"INDEX(SOAL!$J:$J,COLUMN()-6)","v":0},{"$f":"INDEX(SOAL!$J:$J,COLUMN()-6)","v":0},{"$f":"INDEX(SOAL!$J:$J,COLUMN()-6)","v":0},{"$f":"INDEX(SOAL!$J:$J,COLUMN()-6)","v":0},{"$f":"INDEX(SOAL!$J:$J,COLUMN()-6)","v":0},{"$f":"INDEX(SOAL!$J:$J,COLUMN()-6)","v":0},{"$f":"INDEX(SOAL!$J:$J,COLUMN()-6)","v":0},{"$f":"INDEX(SOAL!$J:$J,COLUMN()-6)","v":0},{"$f":"INDEX(SOAL!$J:$J,COLUMN()-6)","v":0},{"$f":"INDEX(SOAL!$J:$J,COLUMN()-6)","v":0},{"$f":"INDEX(SOAL!$J:$J,COLUMN()-6)","v":0},{"$f":"INDEX(SOAL!$J:$J,COLUMN()-6)","v":0},{"$f":"INDEX(SOAL!$J:$J,COLUMN()-6)","v":0},{"$f":"INDEX(SOAL!$J:$J,COLUMN()-6)","v":0},{"$f":"INDEX(SOAL!$J:$J,COLUMN()-6)","v":0},{"$f":"INDEX(SOAL!$J:$J,COLUMN()-6)","v":0},{"$f":"INDEX(SOAL!$J:$J,COLUMN()-6)","v":0},{"$f":"INDEX(SOAL!$J:$J,COLUMN()-6)","v":0},{"$f":"INDEX(SOAL!$J:$J,COLUMN()-6)","v":0},{"$f":"INDEX(SOAL!$J:$J,COLUMN()-6)","v":0},{"$f":"INDEX(SOAL!$J:$J,COLUMN()-6)","v":0},{"$f":"INDEX(SOAL!$J:$J,COLUMN()-6)","v":0},{"$f":"INDEX(SOAL!$J:$J,COLUMN()-6)","v":0},{"$f":"INDEX(SOAL!$J:$J,COLUMN()-6)","v":0},{"$f":"INDEX(SOAL!$J:$J,COLUMN()-6)","v":0},{"$f":"INDEX(SOAL!$J:$J,COLUMN()-6)","v":0},{"$f":"INDEX(SOAL!$J:$J,COLUMN()-6)","v":0},{"$f":"INDEX(SOAL!$J:$J,COLUMN()-6)","v":0},{"$f":"INDEX(SOAL!$J:$J,COLUMN()-6)","v":0},{"$f":"INDEX(SOAL!$J:$J,COLUMN()-6)","v":0},{"$f":"INDEX(SOAL!$J:$J,COLUMN()-6)","v":0},{"$f":"INDEX(SOAL!$J:$J,COLUMN()-6)","v":0},{"$f":"INDEX(SOAL!$J:$J,COLUMN()-6)","v":0},{"$f":"INDEX(SOAL!$J:$J,COLUMN()-6)","v":0},{"$f":"INDEX(SOAL!$J:$J,COLUMN()-6)","v":0},{"$f":"INDEX(SOAL!$J:$J,COLUMN()-6)","v":0},{"$f":"INDEX(SOAL!$J:$J,COLUMN()-6)","v":0},{"$f":"INDEX(SOAL!$J:$J,COLUMN()-6)","v":0},{"$f":"INDEX(SOAL!$J:$J,COLUMN()-6)","v":0},{"$f":"INDEX(SOAL!$J:$J,COLUMN()-6)","v":0},{"$f":"INDEX(SOAL!$J:$J,COLUMN()-6)","v":0},{"$f":"INDEX(SOAL!$J:$J,COLUMN()-6)","v":0},{"$f":"INDEX(SOAL!$J:$J,COLUMN()-6)","v":0},{"$f":"INDEX(SOAL!$J:$J,COLUMN()-6)","v":0},{"$f":"INDEX(SOAL!$J:$J,COLUMN()-6)","v":0},{"$f":"INDEX(SOAL!$J:$J,COLUMN()-6)","v":0},{"$f":"INDEX(SOAL!$J:$J,COLUMN()-6)","v":0},{"$f":"INDEX(SOAL!$J:$J,COLUMN()-6)","v":0},{"$f":"INDEX(SOAL!$J:$J,COLUMN()-6)","v":0},{"$f":"INDEX(SOAL!$J:$J,COLUMN()-6)","v":0},{"$f":"INDEX(SOAL!$J:$J,COLUMN()-6)","v":0},{"$f":"INDEX(SOAL!$J:$J,COLUMN()-6)","v":0},{"$f":"INDEX(SOAL!$J:$J,COLUMN()-6)","v":0},{"$f":"INDEX(SOAL!$J:$J,COLUMN()-6)","v":0},{"$f":"INDEX(SOAL!$J:$J,COLUMN()-6)","v":0},{"$f":"INDEX(SOAL!$J:$J,COLUMN()-6)","v":0},{"$f":"INDEX(SOAL!$J:$J,COLUMN()-6)","v":0},{"$f":"INDEX(SOAL!$J:$J,COLUMN()-6)","v":0},{"$f":"INDEX(SOAL!$J:$J,COLUMN()-6)","v":0},{"$f":"INDEX(SOAL!$J:$J,COLUMN()-6)","v":0},{"$f":"INDEX(SOAL!$J:$J,COLUMN()-6)","v":0},{"$f":"INDEX(SOAL!$J:$J,COLUMN()-6)","v":0},{"$f":"INDEX(SOAL!$J:$J,COLUMN()-6)","v":0},{"$f":"INDEX(SOAL!$J:$J,COLUMN()-6)","v":0},{"$f":"INDEX(SOAL!$J:$J,COLUMN()-6)","v":0},{"$f":"INDEX(SOAL!$J:$J,COLUMN()-6)","v":0},{"$f":"INDEX(SOAL!$J:$J,COLUMN()-6)","v":0},{"$f":"INDEX(SOAL!$J:$J,COLUMN()-6)","v":0},{"$f":"INDEX(SOAL!$J:$J,COLUMN()-6)","v":0},{"$f":"INDEX(SOAL!$J:$J,COLUMN()-6)","v":0},{"$f":"INDEX(SOAL!$J:$J,COLUMN()-6)","v":0},{"$f":"INDEX(SOAL!$J:$J,COLUMN()-6)","v":0},{"$f":"INDEX(SOAL!$J:$J,COLUMN()-6)","v":0},{"$f":"INDEX(SOAL!$J:$J,COLUMN()-6)","v":0},{"$f":"INDEX(SOAL!$J:$J,COLUMN()-6)","v":0},{"$f":"INDEX(SOAL!$J:$J,COLUMN()-6)","v":0},{"$f":"INDEX(SOAL!$J:$J,COLUMN()-6)","v":0},{"$f":"INDEX(SOAL!$J:$J,COLUMN()-6)","v":0},{"$f":"INDEX(SOAL!$J:$J,COLUMN()-6)","v":0},{"$f":"INDEX(SOAL!$J:$J,COLUMN()-6)","v":0},{"$f":"INDEX(SOAL!$J:$J,COLUMN()-6)","v":0},{"$f":"INDEX(SOAL!$J:$J,COLUMN()-6)","v":0},{"$f":"INDEX(SOAL!$J:$J,COLUMN()-6)","v":0},{"$f":"INDEX(SOAL!$J:$J,COLUMN()-6)","v":0},{"$f":"INDEX(SOAL!$J:$J,COLUMN()-6)","v":0},{"$f":"INDEX(SOAL!$J:$J,COLUMN()-6)","v":0},{"$f":"INDEX(SOAL!$J:$J,COLUMN()-6)","v":0},{"$f":"INDEX(SOAL!$J:$J,COLUMN()-6)","v":0},{"$f":"INDEX(SOAL!$J:$J,COLUMN()-6)","v":0},{"$f":"INDEX(SOAL!$J:$J,COLUMN()-6)","v":0},{"$f":"INDEX(SOAL!$J:$J,COLUMN()-6)","v":0},{"$f":"INDEX(SOAL!$J:$J,COLUMN()-6)","v":0},{"$f":"INDEX(SOAL!$J:$J,COLUMN()-6)","v":0},{"$f":"INDEX(SOAL!$J:$J,COLUMN()-6)","v":0},{"$f":"INDEX(SOAL!$J:$J,COLUMN()-6)","v":0},{"$f":"INDEX(SOAL!$J:$J,COLUMN()-6)","v":0},{"$f":"INDEX(SOAL!$J:$J,COLUMN()-6)","v":0},{"$f":"INDEX(SOAL!$J:$J,COLUMN()-6)","v":0},{"$f":"INDEX(SOAL!$J:$J,COLUMN()-6)","v":0},{"$f":"INDEX(SOAL!$J:$J,COLUMN()-6)","v":0},{"$f":"INDEX(SOAL!$J:$J,COLUMN()-6)","v":0},{"$f":"INDEX(SOAL!$J:$J,COLUMN()-6)","v":0},{"$f":"INDEX(SOAL!$J:$J,COLUMN()-6)","v":0},{"$f":"INDEX(SOAL!$J:$J,COLUMN()-6)","v":0},{"$f":"INDEX(SOAL!$J:$J,COLUMN()-6)","v":0},{"$f":"INDEX(SOAL!$J:$J,COLUMN()-6)","v":0},{"$f":"INDEX(SOAL!$J:$J,COLUMN()-6)","v":0},{"$f":"INDEX(SOAL!$J:$J,COLUMN()-6)","v":0},{"$f":"INDEX(SOAL!$J:$J,COLUMN()-6)","v":0},{"$f":"INDEX(SOAL!$J:$J,COLUMN()-6)","v":0},{"$f":"INDEX(SOAL!$J:$J,COLUMN()-6)","v":0},{"$f":"INDEX(SOAL!$J:$J,COLUMN()-6)","v":0},{"$f":"INDEX(SOAL!$J:$J,COLUMN()-6)","v":0},{"$f":"INDEX(SOAL!$J:$J,COLUMN()-6)","v":0},{"$f":"INDEX(SOAL!$J:$J,COLUMN()-6)","v":0},{"$f":"INDEX(SOAL!$J:$J,COLUMN()-6)","v":0},{"$f":"INDEX(SOAL!$J:$J,COLUMN()-6)","v":0},{"$f":"INDEX(SOAL!$J:$J,COLUMN()-6)","v":0},{"$f":"INDEX(SOAL!$J:$J,COLUMN()-6)","v":0},{"$f":"INDEX(SOAL!$J:$J,COLUMN()-6)","v":0},{"$f":"INDEX(SOAL!$J:$J,COLUMN()-6)","v":0},{"$f":"INDEX(SOAL!$J:$J,COLUMN()-6)","v":0},{"$f":"INDEX(SOAL!$J:$J,COLUMN()-6)","v":0},{"$f":"INDEX(SOAL!$J:$J,COLUMN()-6)","v":0},{"$f":"INDEX(SOAL!$J:$J,COLUMN()-6)","v":0},{"$f":"INDEX(SOAL!$J:$J,COLUMN()-6)","v":0},{"$f":"INDEX(SOAL!$J:$J,COLUMN()-6)","v":0},{"$f":"INDEX(SOAL!$J:$J,COLUMN()-6)","v":0},{"$f":"INDEX(SOAL!$J:$J,COLUMN()-6)","v":0},{"$f":"INDEX(SOAL!$J:$J,COLUMN()-6)","v":0},{"$f":"INDEX(SOAL!$J:$J,COLUMN()-6)","v":0},{"$f":"INDEX(SOAL!$J:$J,COLUMN()-6)","v":0},{"$f":"INDEX(SOAL!$J:$J,COLUMN()-6)","v":0},{"$f":"INDEX(SOAL!$J:$J,COLUMN()-6)","v":0},{"$f":"INDEX(SOAL!$J:$J,COLUMN()-6)","v":0},{"$f":"INDEX(SOAL!$J:$J,COLUMN()-6)","v":0},{"$f":"INDEX(SOAL!$J:$J,COLUMN()-6)","v":0},{"$f":"INDEX(SOAL!$J:$J,COLUMN()-6)","v":0}]
[null,null,null,null,null,null,null,null,{"$f":"INDEX(SOAL!$K:$K,COLUMN()-6)","v":"e"},{"$f":"INDEX(SOAL!$K:$K,COLUMN()-6)","v":"b"},{"$f":"INDEX(SOAL!$K:$K,COLUMN()-6)","v":"a"},{"$f":"INDEX(SOAL!$K:$K,COLUMN()-6)","v":"c"},{"$f":"INDEX(SOAL!$K:$K,COLUMN()-6)","v":"c"},{"$f":"INDEX(SOAL!$K:$K,COLUMN()-6)","v":"a"},{"$f":"INDEX(SOAL!$K:$K,COLUMN()-6)","v":"b"},{"$f":"INDEX(SOAL!$K:$K,COLUMN()-6)","v":"c"},{"$f":"INDEX(SOAL!$K:$K,COLUMN()-6)","v":"a"},{"$f":"INDEX(SOAL!$K:$K,COLUMN()-6)","v":"c"},{"$f":"INDEX(SOAL!$K:$K,COLUMN()-6)","v":"a"},{"$f":"INDEX(SOAL!$K:$K,COLUMN()-6)","v":"b"},{"$f":"INDEX(SOAL!$K:$K,COLUMN()-6)","v":"c"},{"$f":"INDEX(SOAL!$K:$K,COLUMN()-6)","v":"d"},{"$f":"INDEX(SOAL!$K:$K,COLUMN()-6)","v":"e"},{"$f":"INDEX(SOAL!$K:$K,COLUMN()-6)","v":"a"},{"$f":"INDEX(SOAL!$K:$K,COLUMN()-6)","v":"b"},{"$f":"INDEX(SOAL!$K:$K,COLUMN()-6)","v":"c"},{"$f":"INDEX(SOAL!$K:$K,COLUMN()-6)","v":"d"},{"$f":"INDEX(SOAL!$K:$K,COLUMN()-6)","v":"e"},{"$f":"INDEX(SOAL!$K:$K,COLUMN()-6)","v":"a"},{"$f":"INDEX(SOAL!$K:$K,COLUMN()-6)","v":"b"},{"$f":"INDEX(SOAL!$K:$K,COLUMN()-6)","v":"c"},{"$f":"INDEX(SOAL!$K:$K,COLUMN()-6)","v":"d"},{"$f":"INDEX(SOAL!$K:$K,COLUMN()-6)","v":"e"},{"$f":"INDEX(SOAL!$K:$K,COLUMN()-6)","v":"a"},{"$f":"INDEX(SOAL!$K:$K,COLUMN()-6)","v":"b"},{"$f":"INDEX(SOAL!$K:$K,COLUMN()-6)","v":"c"},{"$f":"INDEX(SOAL!$K:$K,COLUMN()-6)","v":"d"},{"$f":"INDEX(SOAL!$K:$K,COLUMN()-6)","v":"e"},{"$f":"INDEX(SOAL!$K:$K,COLUMN()-6)","v":"b"},{"$f":"INDEX(SOAL!$K:$K,COLUMN()-6)","v":"d"},{"$f":"INDEX(SOAL!$K:$K,COLUMN()-6)","v":"c"},{"$f":"INDEX(SOAL!$K:$K,COLUMN()-6)","v":"a"},{"$f":"INDEX(SOAL!$K:$K,COLUMN()-6)","v":"b"},{"$f":"INDEX(SOAL!$K:$K,COLUMN()-6)","v":"e"},{"$f":"INDEX(SOAL!$K:$K,COLUMN()-6)","v":"a"},{"$f":"INDEX(SOAL!$K:$K,COLUMN()-6)","v":"c"},{"$f":"INDEX(SOAL!$K:$K,COLUMN()-6)","v":"e"},{"$f":"INDEX(SOAL!$K:$K,COLUMN()-6)","v":"b"},{"$f":"INDEX(SOAL!$K:$K,COLUMN()-6)","v":0},{"$f":"INDEX(SOAL!$K:$K,COLUMN()-6)","v":0},{"$f":"INDEX(SOAL!$K:$K,COLUMN()-6)","v":0},{"$f":"INDEX(SOAL!$K:$K,COLUMN()-6)","v":0},{"$f":"INDEX(SOAL!$K:$K,COLUMN()-6)","v":0},{"$f":"INDEX(SOAL!$K:$K,COLUMN()-6)","v":0},{"$f":"INDEX(SOAL!$K:$K,COLUMN()-6)","v":0},{"$f":"INDEX(SOAL!$K:$K,COLUMN()-6)","v":0},{"$f":"INDEX(SOAL!$K:$K,COLUMN()-6)","v":0},{"$f":"INDEX(SOAL!$K:$K,COLUMN()-6)","v":0},{"$f":"INDEX(SOAL!$K:$K,COLUMN()-6)","v":0},{"$f":"INDEX(SOAL!$K:$K,COLUMN()-6)","v":0},{"$f":"INDEX(SOAL!$K:$K,COLUMN()-6)","v":0},{"$f":"INDEX(SOAL!$K:$K,COLUMN()-6)","v":0},{"$f":"INDEX(SOAL!$K:$K,COLUMN()-6)","v":0},{"$f":"INDEX(SOAL!$K:$K,COLUMN()-6)","v":0},{"$f":"INDEX(SOAL!$K:$K,COLUMN()-6)","v":0},{"$f":"INDEX(SOAL!$K:$K,COLUMN()-6)","v":0},{"$f":"INDEX(SOAL!$K:$K,COLUMN()-6)","v":0},{"$f":"INDEX(SOAL!$K:$K,COLUMN()-6)","v":0},{"$f":"INDEX(SOAL!$K:$K,COLUMN()-6)","v":0},{"$f":"INDEX(SOAL!$K:$K,COLUMN()-6)","v":0},{"$f":"INDEX(SOAL!$K:$K,COLUMN()-6)","v":0},{"$f":"INDEX(SOAL!$K:$K,COLUMN()-6)","v":0},{"$f":"INDEX(SOAL!$K:$K,COLUMN()-6)","v":0},{"$f":"INDEX(SOAL!$K:$K,COLUMN()-6)","v":0},{"$f":"INDEX(SOAL!$K:$K,COLUMN()-6)","v":0},{"$f":"INDEX(SOAL!$K:$K,COLUMN()-6)","v":0},{"$f":"INDEX(SOAL!$K:$K,COLUMN()-6)","v":0},{"$f":"INDEX(SOAL!$K:$K,COLUMN()-6)","v":0},{"$f":"INDEX(SOAL!$K:$K,COLUMN()-6)","v":0},{"$f":"INDEX(SOAL!$K:$K,COLUMN()-6)","v":0},{"$f":"INDEX(SOAL!$K:$K,COLUMN()-6)","v":0},{"$f":"INDEX(SOAL!$K:$K,COLUMN()-6)","v":0},{"$f":"INDEX(SOAL!$K:$K,COLUMN()-6)","v":0},{"$f":"INDEX(SOAL!$K:$K,COLUMN()-6)","v":0},{"$f":"INDEX(SOAL!$K:$K,COLUMN()-6)","v":0},{"$f":"INDEX(SOAL!$K:$K,COLUMN()-6)","v":0},{"$f":"INDEX(SOAL!$K:$K,COLUMN()-6)","v":0},{"$f":"INDEX(SOAL!$K:$K,COLUMN()-6)","v":0},{"$f":"INDEX(SOAL!$K:$K,COLUMN()-6)","v":0},{"$f":"INDEX(SOAL!$K:$K,COLUMN()-6)","v":0},{"$f":"INDEX(SOAL!$K:$K,COLUMN()-6)","v":0},{"$f":"INDEX(SOAL!$K:$K,COLUMN()-6)","v":0},{"$f":"INDEX(SOAL!$K:$K,COLUMN()-6)","v":0},{"$f":"INDEX(SOAL!$K:$K,COLUMN()-6)","v":0},{"$f":"INDEX(SOAL!$K:$K,COLUMN()-6)","v":0},{"$f":"INDEX(SOAL!$K:$K,COLUMN()-6)","v":0},{"$f":"INDEX(SOAL!$K:$K,COLUMN()-6)","v":0},{"$f":"INDEX(SOAL!$K:$K,COLUMN()-6)","v":0},{"$f":"INDEX(SOAL!$K:$K,COLUMN()-6)","v":0},{"$f":"INDEX(SOAL!$K:$K,COLUMN()-6)","v":0},{"$f":"INDEX(SOAL!$K:$K,COLUMN()-6)","v":0},{"$f":"INDEX(SOAL!$K:$K,COLUMN()-6)","v":0},{"$f":"INDEX(SOAL!$K:$K,COLUMN()-6)","v":0},{"$f":"INDEX(SOAL!$K:$K,COLUMN()-6)","v":0},{"$f":"INDEX(SOAL!$K:$K,COLUMN()-6)","v":0},{"$f":"INDEX(SOAL!$K:$K,COLUMN()-6)","v":0},{"$f":"INDEX(SOAL!$K:$K,COLUMN()-6)","v":0},{"$f":"INDEX(SOAL!$K:$K,COLUMN()-6)","v":0},{"$f":"INDEX(SOAL!$K:$K,COLUMN()-6)","v":0},{"$f":"INDEX(SOAL!$K:$K,COLUMN()-6)","v":0},{"$f":"INDEX(SOAL!$K:$K,COLUMN()-6)","v":0},{"$f":"INDEX(SOAL!$K:$K,COLUMN()-6)","v":0},{"$f":"INDEX(SOAL!$K:$K,COLUMN()-6)","v":0},{"$f":"INDEX(SOAL!$K:$K,COLUMN()-6)","v":0},{"$f":"INDEX(SOAL!$K:$K,COLUMN()-6)","v":0},{"$f":"INDEX(SOAL!$K:$K,COLUMN()-6)","v":0},{"$f":"INDEX(SOAL!$K:$K,COLUMN()-6)","v":0},{"$f":"INDEX(SOAL!$K:$K,COLUMN()-6)","v":0},{"$f":"INDEX(SOAL!$K:$K,COLUMN()-6)","v":0},{"$f":"INDEX(SOAL!$K:$K,COLUMN()-6)","v":0},{"$f":"INDEX(SOAL!$K:$K,COLUMN()-6)","v":0},{"$f":"INDEX(SOAL!$K:$K,COLUMN()-6)","v":0},{"$f":"INDEX(SOAL!$K:$K,COLUMN()-6)","v":0},{"$f":"INDEX(SOAL!$K:$K,COLUMN()-6)","v":0},{"$f":"INDEX(SOAL!$K:$K,COLUMN()-6)","v":0},{"$f":"INDEX(SOAL!$K:$K,COLUMN()-6)","v":0},{"$f":"INDEX(SOAL!$K:$K,COLUMN()-6)","v":0},{"$f":"INDEX(SOAL!$K:$K,COLUMN()-6)","v":0},{"$f":"INDEX(SOAL!$K:$K,COLUMN()-6)","v":0},{"$f":"INDEX(SOAL!$K:$K,COLUMN()-6)","v":0},{"$f":"INDEX(SOAL!$K:$K,COLUMN()-6)","v":0},{"$f":"INDEX(SOAL!$K:$K,COLUMN()-6)","v":0},{"$f":"INDEX(SOAL!$K:$K,COLUMN()-6)","v":0},{"$f":"INDEX(SOAL!$K:$K,COLUMN()-6)","v":0},{"$f":"INDEX(SOAL!$K:$K,COLUMN()-6)","v":0},{"$f":"INDEX(SOAL!$K:$K,COLUMN()-6)","v":0},{"$f":"INDEX(SOAL!$K:$K,COLUMN()-6)","v":0},{"$f":"INDEX(SOAL!$K:$K,COLUMN()-6)","v":0},{"$f":"INDEX(SOAL!$K:$K,COLUMN()-6)","v":0},{"$f":"INDEX(SOAL!$K:$K,COLUMN()-6)","v":0},{"$f":"INDEX(SOAL!$K:$K,COLUMN()-6)","v":0},{"$f":"INDEX(SOAL!$K:$K,COLUMN()-6)","v":0},{"$f":"INDEX(SOAL!$K:$K,COLUMN()-6)","v":0},{"$f":"INDEX(SOAL!$K:$K,COLUMN()-6)","v":0},{"$f":"INDEX(SOAL!$K:$K,COLUMN()-6)","v":0},{"$f":"INDEX(SOAL!$K:$K,COLUMN()-6)","v":0},{"$f":"INDEX(SOAL!$K:$K,COLUMN()-6)","v":0},{"$f":"INDEX(SOAL!$K:$K,COLUMN()-6)","v":0},{"$f":"INDEX(SOAL!$K:$K,COLUMN()-6)","v":0},{"$f":"INDEX(SOAL!$K:$K,COLUMN()-6)","v":0},{"$f":"INDEX(SOAL!$K:$K,COLUMN()-6)","v":0},{"$f":"INDEX(SOAL!$K:$K,COLUMN()-6)","v":0},{"$f":"INDEX(SOAL!$K:$K,COLUMN()-6)","v":0},{"$f":"INDEX(SOAL!$K:$K,COLUMN()-6)","v":0},{"$f":"INDEX(SOAL!$K:$K,COLUMN()-6)","v":0},{"$f":"INDEX(SOAL!$K:$K,COLUMN()-6)","v":0},{"$f":"INDEX(SOAL!$K:$K,COLUMN()-6)","v":0},{"$f":"INDEX(SOAL!$K:$K,COLUMN()-6)","v":0},{"$f":"INDEX(SOAL!$K:$K,COLUMN()-6)","v":0},{"$f":"INDEX(SOAL!$K:$K,COLUMN()-6)","v":0},{"$f":"INDEX(SOAL!$K:$K,COLUMN()-6)","v":0},{"$f":"INDEX(SOAL!$K:$K,COLUMN()-6)","v":0},{"$f":"INDEX(SOAL!$K:$K,COLUMN()-6)","v":0},{"$f":"INDEX(SOAL!$K:$K,COLUMN()-6)","v":0},{"$f":"INDEX(SOAL!$K:$K,COLUMN()-6)","v":0},{"$f":"INDEX(SOAL!$K:$K,COLUMN()-6)","v":0},{"$f":"INDEX(SOAL!$K:$K,COLUMN()-6)","v":0},{"$f":"INDEX(SOAL!$K:$K,COLUMN()-6)","v":0},{"$f":"INDEX(SOAL!$K:$K,COLUMN()-6)","v":0},{"$f":"INDEX(SOAL!$K:$K,COLUMN()-6)","v":0},{"$f":"INDEX(SOAL!$K:$K,COLUMN()-6)","v":0},{"$f":"INDEX(SOAL!$K:$K,COLUMN()-6)","v":0},{"$f":"INDEX(SOAL!$K:$K,COLUMN()-6)","v":0},{"$f":"INDEX(SOAL!$K:$K,COLUMN()-6)","v":0},{"$f":"INDEX(SOAL!$K:$K,COLUMN()-6)","v":0},{"$f":"INDEX(SOAL!$K:$K,COLUMN()-6)","v":0},{"$f":"INDEX(SOAL!$K:$K,COLUMN()-6)","v":0},{"$f":"INDEX(SOAL!$K:$K,COLUMN()-6)","v":0},{"$f":"INDEX(SOAL!$K:$K,COLUMN()-6)","v":0},{"$f":"INDEX(SOAL!$K:$K,COLUMN()-6)","v":0},{"$f":"INDEX(SOAL!$K:$K,COLUMN()-6)","v":0},{"$f":"INDEX(SOAL!$K:$K,COLUMN()-6)","v":0},{"$f":"INDEX(SOAL!$K:$K,COLUMN()-6)","v":0},{"$f":"INDEX(SOAL!$K:$K,COLUMN()-6)","v":0},{"$f":"INDEX(SOAL!$K:$K,COLUMN()-6)","v":0},{"$f":"INDEX(SOAL!$K:$K,COLUMN()-6)","v":0},{"$f":"INDEX(SOAL!$K:$K,COLUMN()-6)","v":0},{"$f":"INDEX(SOAL!$K:$K,COLUMN()-6)","v":0},{"$f":"INDEX(SOAL!$K:$K,COLUMN()-6)","v":0},{"$f":"INDEX(SOAL!$K:$K,COLUMN()-6)","v":0},{"$f":"INDEX(SOAL!$K:$K,COLUMN()-6)","v":0},{"$f":"INDEX(SOAL!$K:$K,COLUMN()-6)","v":0},{"$f":"INDEX(SOAL!$K:$K,COLUMN()-6)","v":0},{"$f":"INDEX(SOAL!$K:$K,COLUMN()-6)","v":0},{"$f":"INDEX(SOAL!$K:$K,COLUMN()-6)","v":0},{"$f":"INDEX(SOAL!$K:$K,COLUMN()-6)","v":0},{"$f":"INDEX(SOAL!$K:$K,COLUMN()-6)","v":0},{"$f":"INDEX(SOAL!$K:$K,COLUMN()-6)","v":0},{"$f":"INDEX(SOAL!$K:$K,COLUMN()-6)","v":0},{"$f":"INDEX(SOAL!$K:$K,COLUMN()-6)","v":0},{"$f":"INDEX(SOAL!$K:$K,COLUMN()-6)","v":0},{"$f":"INDEX(SOAL!$K:$K,COLUMN()-6)","v":0},{"$f":"INDEX(SOAL!$K:$K,COLUMN()-6)","v":0},{"$f":"INDEX(SOAL!$K:$K,COLUMN()-6)","v":0},{"$f":"INDEX(SOAL!$K:$K,COLUMN()-6)","v":0},{"$f":"INDEX(SOAL!$K:$K,COLUMN()-6)","v":0},{"$f":"INDEX(SOAL!$K:$K,COLUMN()-6)","v":0},{"$f":"INDEX(SOAL!$K:$K,COLUMN()-6)","v":0},{"$f":"INDEX(SOAL!$K:$K,COLUMN()-6)","v":0},{"$f":"INDEX(SOAL!$K:$K,COLUMN()-6)","v":0},{"$f":"INDEX(SOAL!$K:$K,COLUMN()-6)","v":0}]